Cookie Consent by Free Privacy Policy Generator ๐Ÿ“Œ Some of these libraries may not be found correctly (Anaconda the cause here?)

๐Ÿ  Team IT Security News

TSecurity.de ist eine Online-Plattform, die sich auf die Bereitstellung von Informationen,alle 15 Minuten neuste Nachrichten, Bildungsressourcen und Dienstleistungen rund um das Thema IT-Sicherheit spezialisiert hat.
Ob es sich um aktuelle Nachrichten, Fachartikel, Blogbeitrรคge, Webinare, Tutorials, oder Tipps & Tricks handelt, TSecurity.de bietet seinen Nutzern einen umfassenden รœberblick รผber die wichtigsten Aspekte der IT-Sicherheit in einer sich stรคndig verรคndernden digitalen Welt.

16.12.2023 - TIP: Wer den Cookie Consent Banner akzeptiert, kann z.B. von Englisch nach Deutsch รผbersetzen, erst Englisch auswรคhlen dann wieder Deutsch!

Google Android Playstore Download Button fรผr Team IT Security



๐Ÿ“š Some of these libraries may not be found correctly (Anaconda the cause here?)


๐Ÿ’ก Newskategorie: Linux Tipps
๐Ÿ”— Quelle: reddit.com

Does anyone have experience with this kind of error when installing a QT application? My guess is, anaconda has something to do with it in the present case. I am thankful for any help.

aking package: lightly-qt 0.4-1 (Mon 08 Feb 2021 10:05:23 CET)
==> Checking runtime dependenciesโ€ฆ
==> Checking buildtime dependenciesโ€ฆ
==> WARNING: Using existing $srcdir/ tree
==> Starting build()โ€ฆ
โ€“ The C compiler identification is GNU 10.2.0
โ€“ The CXX compiler identification is GNU 10.2.0
โ€“ Detecting C compiler ABI info
โ€“ Detecting C compiler ABI info - done
โ€“ Check for working C compiler: /usr/bin/cc - skipped
โ€“ Detecting C compile features
โ€“ Detecting C compile features - done
โ€“ Detecting CXX compiler ABI info
โ€“ Detecting CXX compiler ABI info - done
โ€“ Check for working CXX compiler: /usr/bin/c++ - skipped
โ€“ Detecting CXX compile features
โ€“ Detecting CXX compile features - done
Installing in /usr. Run /home/meck/.cache/yay/lightly-qt/src/Lightly-0.4/build/prefix.sh to set the environment for lightly.
โ€“ Looking for GLIBC
โ€“ Looking for GLIBC - found
โ€“ Performing Test _OFFT_IS_64BIT
โ€“ Performing Test _OFFT_IS_64BIT - Success
โ€“ Performing Test HAVE_DATE_TIME
โ€“ Performing Test HAVE_DATE_TIME - Success
โ€“ Found KF5CoreAddons: /usr/lib64/cmake/KF5CoreAddons/KF5CoreAddonsConfig.cmake (found version โ€œ5.78.0โ€)
โ€“ Found KF5GuiAddons: /usr/lib64/cmake/KF5GuiAddons/KF5GuiAddonsConfig.cmake (found version โ€œ5.78.0โ€)
โ€“ Found KF5ConfigWidgets: /usr/lib64/cmake/KF5ConfigWidgets/KF5ConfigWidgetsConfig.cmake (found version โ€œ5.78.0โ€)
โ€“ Found KF5WindowSystem: /usr/lib64/cmake/KF5WindowSystem/KF5WindowSystemConfig.cmake (found version โ€œ5.78.0โ€)
โ€“ Found Gettext: /usr/bin/msgmerge (found version โ€œ0.21โ€)
โ€“ Found KF5I18n: /usr/lib64/cmake/KF5I18n/KF5I18nConfig.cmake (found version โ€œ5.78.0โ€)
โ€“ Found KF5IconThemes: /usr/lib64/cmake/KF5IconThemes/KF5IconThemesConfig.cmake (found version โ€œ5.78.0โ€)
โ€“ Found KF5: success (found version โ€œ5.78.0โ€) found components: CoreAddons GuiAddons ConfigWidgets WindowSystem I18n IconThemes
โ€“ Found PkgConfig: /usr/bin/pkg-config (found version โ€œ1.7.3โ€)
โ€“ Found XCB_XCB: /usr/lib/libxcb.so (found version โ€œ1.14โ€)
โ€“ Found XCB: /usr/lib/libxcb.so (found version โ€œ1.14โ€) found components: XCB
โ€“ Warning: Property URL already set to โ€œhttps://xcb.freedesktop.org/โ€, overriding it with โ€œhttps://xcb.freedesktop.orgโ€
โ€“ Performing Test COMPILER_HAS_HIDDEN_VISIBILITY
โ€“ Performing Test COMPILER_HAS_HIDDEN_VISIBILITY - Success
โ€“ Performing Test COMPILER_HAS_HIDDEN_INLINE_VISIBILITY
โ€“ Performing Test COMPILER_HAS_HIDDEN_INLINE_VISIBILITY - Success
โ€“ Performing Test COMPILER_HAS_DEPRECATED_ATTR
โ€“ Performing Test COMPILER_HAS_DEPRECATED_ATTR - Success
โ€“ Found KF5Config: /usr/lib64/cmake/KF5Config/KF5ConfigConfig.cmake (found version โ€œ5.78.0โ€)
โ€“ Found KF5: success (found version โ€œ5.78.0โ€) found components: I18n Config GuiAddons IconThemes ConfigWidgets WindowSystem
โ€“ Warning: Property URL already set to โ€œhttps://xcb.freedesktop.orgโ€, overriding it with โ€œhttps://xcb.freedesktop.org/โ€
โ€“ Warning: Property URL already set to โ€œhttps://xcb.freedesktop.org/โ€, overriding it with โ€œhttps://xcb.freedesktop.orgโ€
Installing in /usr. Run /home/meck/.cache/yay/lightly-qt/src/Lightly-0.4/build/misc/kde4lightly/prefix.sh to set the environment for lightly.
โ€“ Found KF5: success (found version โ€œ5.78.0โ€) found components: CoreAddons Config
CMake Warning (dev) at /usr/share/ECM/modules/ECMPackageConfigHelpers.cmake:63 (message):
Your project already requires a version of CMake that includes the
find_dependency macro via the CMakeFindDependencyMacro module. You should
use CMakePackageConfigHelpers instead of ECMPackageConfigHelpers.
Call Stack (most recent call first):
misc/kde4lightly/CMakeLists.txt:12 (include)
This warning is for project developers. Use -Wno-dev to suppress it.
โ€“ The following OPTIONAL packages have been found:
Qt5Network (required version >= 5.9.7)
Qt5Qml (required version >= 5.9.7)
Qt5Quick
KF5FrameworkIntegration, KF5 Framework Integration, https://projects.kde.org/projects/frameworks/frameworkintegration
Required to use KStyle convenience functionalities in style
PkgConfig
XCB, X protocol C-language Binding, https://xcb.freedesktop.org
Required to pass style properties to native Windows on X11 Platform
Required to pass style properties to native Windows on X11 Platform
KF5Wayland
KF5Auth (required version >= 5.78.0)
KF5Codecs (required version >= 5.78.0)
KF5WidgetsAddons (required version >= 5.78.0)
KF5Service (required version >= 5.78.0)
KF5KCMUtils, KF5 KCM utils Framework, https://projects.kde.org/projects/frameworks/kcmutils
Required for lightly-settings5 application to build
Qt5Core (required version >= 5.14.0)
โ€“ The following REQUIRED packages have been found:
KDecoration2
Gettext
KF5I18n
KF5GuiAddons
KF5WindowSystem
KF5IconThemes (required version >= 5.78.0)
Qt5X11Extras
KF5ConfigWidgets (required version >= 5.78.0)
ECM (required version >= 0.0.13)
Qt5Widgets
Qt5
KF5CoreAddons
Qt5DBus (required version >= 5.14.0)
KF5Config
KF5
โ€“ Configuring done
CMake Warning at kdecoration/CMakeLists.txt:67 (add_library):
Cannot generate a safe runtime search path for target lightlydecoration
because files in some directories may conflict with libraries in implicit
directories:
runtime library [libxcb.so.1] in /usr/lib may be hidden by files in: /home/meck/anaconda3/lib runtime library [libQt5Xml.so.5] in /usr/lib may be hidden by files in: /home/meck/anaconda3/lib runtime library [libQt5DBus.so.5] in /usr/lib may be hidden by files in: /home/meck/anaconda3/lib runtime library [libQt5Widgets.so.5] in /usr/lib may be hidden by files in: /home/meck/anaconda3/lib runtime library [libQt5Gui.so.5] in /usr/lib may be hidden by files in: /home/meck/anaconda3/lib Some of these libraries may not be found correctly.
CMake Warning at liblightlycommon/CMakeLists.txt:10 (add_library):
Cannot generate a safe runtime search path for target lightlycommon5
because files in some directories may conflict with libraries in implicit
directories:
runtime library [libQt5Gui.so.5] in /usr/lib may be hidden by files in: /home/meck/anaconda3/lib Some of these libraries may not be found correctly.
CMake Warning at kstyle/CMakeLists.txt:104 (add_library):
Cannot generate a safe runtime search path for target lightly because files
in some directories may conflict with libraries in implicit directories:
runtime library [libxcb.so.1] in /usr/lib may be hidden by files in: /home/meck/anaconda3/lib runtime library [libQt5Xml.so.5] in /usr/lib may be hidden by files in: /home/meck/anaconda3/lib runtime library [libQt5DBus.so.5] in /usr/lib may be hidden by files in: /home/meck/anaconda3/lib runtime library [libQt5Widgets.so.5] in /usr/lib may be hidden by files in: /home/meck/anaconda3/lib runtime library [libQt5Gui.so.5] in /usr/lib may be hidden by files in: /home/meck/anaconda3/lib Some of these libraries may not be found correctly.
CMake Warning at kstyle/config/CMakeLists.txt:31 (add_executable):
Cannot generate a safe runtime search path for target lightly-settings5
because files in some directories may conflict with libraries in implicit
directories:
runtime library [libQt5Widgets.so.5] in /usr/lib may be hidden by files in: /home/meck/anaconda3/lib runtime library [libQt5Xml.so.5] in /usr/lib may be hidden by files in: /home/meck/anaconda3/lib runtime library [libQt5DBus.so.5] in /usr/lib may be hidden by files in: /home/meck/anaconda3/lib runtime library [libQt5Gui.so.5] in /usr/lib may be hidden by files in: /home/meck/anaconda3/lib Some of these libraries may not be found correctly.
CMake Warning at kstyle/config/CMakeLists.txt:31 (add_executable):
Cannot generate a safe dependent library path for target lightly-settings5
because files in some directories may conflict with libraries in implicit
directories:
runtime library [libQt5DBus.so.5] in /usr/lib may be hidden by files in: /home/meck/anaconda3/lib Some of these libraries may not be found correctly.
CMake Warning at kstyle/config/CMakeLists.txt:11 (add_library):
Cannot generate a safe runtime search path for target kstyle_lightly_config
because files in some directories may conflict with libraries in implicit
directories:
runtime library [libQt5Xml.so.5] in /usr/lib may be hidden by files in: /home/meck/anaconda3/lib runtime library [libQt5Widgets.so.5] in /usr/lib may be hidden by files in: /home/meck/anaconda3/lib runtime library [libQt5DBus.so.5] in /usr/lib may be hidden by files in: /home/meck/anaconda3/lib runtime library [libQt5Gui.so.5] in /usr/lib may be hidden by files in: /home/meck/anaconda3/lib Some of these libraries may not be found correctly.
CMake Warning at misc/kde4lightly/src/CMakeLists.txt:9 (add_executable):
Cannot generate a safe runtime search path for target kde4lightly because
files in some directories may conflict with libraries in implicit
directories:
runtime library [libQt5Widgets.so.5] in /usr/lib may be hidden by files in: /home/meck/anaconda3/lib runtime library [libQt5Gui.so.5] in /usr/lib may be hidden by files in: /home/meck/anaconda3/lib runtime library [libQt5DBus.so.5] in /usr/lib may be hidden by files in: /home/meck/anaconda3/lib Some of these libraries may not be found correctly.
โ€“ Generating done
โ€“ Build files have been written to: /home/meck/.cache/yay/lightly-qt/src/Lightly-0.4/build
Scanning dependencies of target lightly-settings5_autogen
Scanning dependencies of target kstyle_lightly_config_autogen
Scanning dependencies of target lightlycommon5_autogen
Scanning dependencies of target kde4lightly_autogen
[ 2%] Automatic MOC for target kstyle_lightly_config
[ 2%] Automatic MOC for target lightly-settings5
[ 4%] Automatic MOC for target kde4lightly
[ 4%] Automatic MOC for target lightlycommon5
AutoMoc subprocess error
The moc process failed to compile
โ€œSRC:/kstyle/config/lightlystyleconfig.hโ€
into
โ€œSRC:/build/kstyle/config/kstyle_lightly_config_autogen/EWIEGA46WW/moc_lightlystyleconfig.cppโ€
Command
/home/meck/anaconda3/bin/moc -DKCOREADDONS_LIB -DQT_CORE_LIB -DQT_DBUS_LIB -DQT_GUI_LIB -DQT_NO_DEBUG -DQT_WIDGETS_LIB -DQT_XML_LIB โ€œ-DTRANSLATION_DOMAIN=โ€œlightly_style_configโ€โ€ -D_GNU_SOURCE -D_LARGEFILE64_SOURCE -Dkstyle_lightly_config_EXPORTS -I/home/meck/.cache/yay/lightly-qt/src/Lightly-0.4/build/kstyle/config -I/home/meck/.cache/yay/lightly-qt/src/Lightly-0.4/kstyle/config -I/home/meck/.cache/yay/lightly-qt/src/Lightly-0.4/kstyle/animations -I/home/meck/.cache/yay/lightly-qt/src/Lightly-0.4/kstyle/debug -I/home/meck/.cache/yay/lightly-qt/src/Lightly-0.4/liblightlycommon -I/home/meck/.cache/yay/lightly-qt/src/Lightly-0.4/build/liblightlycommon -I/home/meck/anaconda3/include/qt -I/home/meck/anaconda3/include/qt/QtCore -I/home/meck/anaconda3/mkspecs/linux-g++ -I/usr/include/qt -I/usr/include/qt/QtGui -I/usr/include/qt/QtWidgets -I/usr/include/qt/QtDBus -I/usr/include/KF5/KConfigCore -I/usr/include/KF5 -I/usr/include/KF5/KConfigWidgets -I/usr/include/KF5/KCodecs -I/usr/include/KF5/KWidgetsAddons -I/usr/include/KF5/KConfigGui -I/usr/include/qt/QtXml -I/usr/include/KF5/KAuth -I/usr/include/KF5/KCoreAddons -I/usr/include/KF5/KI18n -I/usr/include/c++/10.2.0 -I/usr/include/c++/10.2.0/x86_64-pc-linux-gnu -I/usr/include/c++/10.2.0/backward -I/usr/lib/gcc/x86_64-pc-linux-gnu/10.2.0/include -I/usr/local/include -I/usr/lib/gcc/x86_64-pc-linux-gnu/10.2.0/include-fixed -I/usr/include --include /home/meck/.cache/yay/lightly-qt/src/Lightly-0.4/build/kstyle/config/kstyle_lightly_config_autogen/moc_predefs.h --output-dep-file -o /home/meck/.cache/yay/lightly-qt/src/Lightly-0.4/build/kstyle/config/kstyle_lightly_config_autogen/EWIEGA46WW/moc_lightlystyleconfig.cpp /home/meck/.cache/yay/lightly-qt/src/Lightly-0.4/kstyle/config/lightlystyleconfig.h
Output
Unknown option โ€˜output-dep-fileโ€™.
AutoMoc subprocess error
The moc process failed to compile
โ€œSRC:/kstyle/config/lightlystyleconfigmodule.cppโ€
into
โ€œSRC:/build/kstyle/config/kstyle_lightly_config_autogen/include/lightlystyleconfigmodule.mocโ€
included by
โ€œSRC:/kstyle/config/lightlystyleconfigmodule.cppโ€
Command
/home/meck/anaconda3/bin/moc -DKCOREADDONS_LIB -DQT_CORE_LIB -DQT_DBUS_LIB -DQT_GUI_LIB -DQT_NO_DEBUG -DQT_WIDGETS_LIB -DQT_XML_LIB โ€œ-DTRANSLATION_DOMAIN=โ€œlightly_style_configโ€โ€ -D_GNU_SOURCE -D_LARGEFILE64_SOURCE -Dkstyle_lightly_config_EXPORTS -I/home/meck/.cache/yay/lightly-qt/src/Lightly-0.4/build/kstyle/config -I/home/meck/.cache/yay/lightly-qt/src/Lightly-0.4/kstyle/config -I/home/meck/.cache/yay/lightly-qt/src/Lightly-0.4/kstyle/animations -I/home/meck/.cache/yay/lightly-qt/src/Lightly-0.4/kstyle/debug -I/home/meck/.cache/yay/lightly-qt/src/Lightly-0.4/liblightlycommon -I/home/meck/.cache/yay/lightly-qt/src/Lightly-0.4/build/liblightlycommon -I/home/meck/anaconda3/include/qt -I/home/meck/anaconda3/include/qt/QtCore -I/home/meck/anaconda3/mkspecs/linux-g++ -I/usr/include/qt -I/usr/include/qt/QtGui -I/usr/include/qt/QtWidgets -I/usr/include/qt/QtDBus -I/usr/include/KF5/KConfigCore -I/usr/include/KF5 -I/usr/include/KF5/KConfigWidgets -I/usr/include/KF5/KCodecs -I/usr/include/KF5/KWidgetsAddons -I/usr/include/KF5/KConfigGui -I/usr/include/qt/QtXml -I/usr/include/KF5/KAuth -I/usr/include/KF5/KCoreAddons -I/usr/include/KF5/KI18n -I/usr/include/c++/10.2.0 -I/usr/include/c++/10.2.0/x86_64-pc-linux-gnu -I/usr/include/c++/10.2.0/backward -I/usr/lib/gcc/x86_64-pc-linux-gnu/10.2.0/include -I/usr/local/include -I/usr/lib/gcc/x86_64-pc-linux-gnu/10.2.0/include-fixed -I/usr/include --include /home/meck/.cache/yay/lightly-qt/src/Lightly-0.4/build/kstyle/config/kstyle_lightly_config_autogen/moc_predefs.h --output-dep-file -o /home/meck/.cache/yay/lightly-qt/src/Lightly-0.4/build/kstyle/config/kstyle_lightly_config_autogen/include/lightlystyleconfigmodule.moc /home/meck/.cache/yay/lightly-qt/src/Lightly-0.4/kstyle/config/lightlystyleconfigmodule.cpp
Output
Unknown option โ€˜output-dep-fileโ€™.
AutoMoc subprocess error
The moc process failed to compile
โ€œSRC:/kstyle/config/lightlystyleconfigmodule.hโ€
into
โ€œSRC:/build/kstyle/config/kstyle_lightly_config_autogen/EWIEGA46WW/moc_lightlystyleconfigmodule.cppโ€
Command
/home/meck/anaconda3/bin/moc -DKCOREADDONS_LIB -DQT_CORE_LIB -DQT_DBUS_LIB -DQT_GUI_LIB -DQT_NO_DEBUG -DQT_WIDGETS_LIB -DQT_XML_LIB โ€œ-DTRANSLATION_DOMAIN=โ€œlightly_style_configโ€โ€ -D_GNU_SOURCE -D_LARGEFILE64_SOURCE -Dkstyle_lightly_config_EXPORTS -I/home/meck/.cache/yay/lightly-qt/src/Lightly-0.4/build/kstyle/config -I/home/meck/.cache/yay/lightly-qt/src/Lightly-0.4/kstyle/config -I/home/meck/.cache/yay/lightly-qt/src/Lightly-0.4/kstyle/animations -I/home/meck/.cache/yay/lightly-qt/src/Lightly-0.4/kstyle/debug -I/home/meck/.cache/yay/lightly-qt/src/Lightly-0.4/liblightlycommon -I/home/meck/.cache/yay/lightly-qt/src/Lightly-0.4/build/liblightlycommon -I/home/meck/anaconda3/include/qt -I/home/meck/anaconda3/include/qt/QtCore -I/home/meck/anaconda3/mkspecs/linux-g++ -I/usr/include/qt -I/usr/include/qt/QtGui -I/usr/include/qt/QtWidgets -I/usr/include/qt/QtDBus -I/usr/include/KF5/KConfigCore -I/usr/include/KF5 -I/usr/include/KF5/KConfigWidgets -I/usr/include/KF5/KCodecs -I/usr/include/KF5/KWidgetsAddons -I/usr/include/KF5/KConfigGui -I/usr/include/qt/QtXml -I/usr/include/KF5/KAuth -I/usr/include/KF5/KCoreAddons -I/usr/include/KF5/KI18n -I/usr/include/c++/10.2.0 -I/usr/include/c++/10.2.0/x86_64-pc-linux-gnu -I/usr/include/c++/10.2.0/backward -I/usr/lib/gcc/x86_64-pc-linux-gnu/10.2.0/include -I/usr/local/include -I/usr/lib/gcc/x86_64-pc-linux-gnu/10.2.0/include-fixed -I/usr/include --include /home/meck/.cache/yay/lightly-qt/src/Lightly-0.4/build/kstyle/config/kstyle_lightly_config_autogen/moc_predefs.h --output-dep-file -o /home/meck/.cache/yay/lightly-qt/src/Lightly-0.4/build/kstyle/config/kstyle_lightly_config_autogen/EWIEGA46WW/moc_lightlystyleconfigmodule.cpp /home/meck/.cache/yay/lightly-qt/src/Lightly-0.4/kstyle/config/lightlystyleconfigmodule.h
Output
Unknown option โ€˜output-dep-fileโ€™.
make[2]: *** [kstyle/config/CMakeFiles/kstyle_lightly_config_autogen.dir/build.make:77: kstyle/config/CMakeFiles/kstyle_lightly_config_autogen] Error 1
make[1]: *** [CMakeFiles/Makefile2:954: kstyle/config/CMakeFiles/kstyle_lightly_config_autogen.dir/all] Error 2
make[1]: *** Waiting for unfinished jobsโ€ฆ
[ 4%] Built target kde4lightly_autogen
[ 4%] Built target lightlycommon5_autogen
[ 4%] Built target lightly-settings5_autogen
make: *** [Makefile:149: all] Error 2
==> ERROR: A failure occurred in build().
Abortingโ€ฆ
error making: lightly-qt

submitted by /u/LilSaindt
[link] [comments] ...



๐Ÿ“Œ Some of these libraries may not be found correctly (Anaconda the cause here?)


๐Ÿ“ˆ 110.21 Punkte

๐Ÿ“Œ How to map the Stadia Controller to SDL2 correctly (this may work for any other controllers you may have trouble with)


๐Ÿ“ˆ 32.99 Punkte

๐Ÿ“Œ This may not be news to some (or most) of you, but I just found out my computer's chipset has an ARM9 CPU running Linux


๐Ÿ“ˆ 27.66 Punkte

๐Ÿ“Œ Iโ€™m not sure I can post this here, but I found these Google suggestions funny.


๐Ÿ“ˆ 27.44 Punkte

๐Ÿ“Œ Correctly Validating IP Addresses: Why encoding matters for input validation., (Mon, May 10th)


๐Ÿ“ˆ 26.19 Punkte

๐Ÿ“Œ phpPgAdmin up to 4.2.1 Libraries libraries/lib.inc.php _language directory traversal


๐Ÿ“ˆ 24.92 Punkte

๐Ÿ“Œ Windows 10 Creators Update Bug: Night Light Not Turning Off Correctly


๐Ÿ“ˆ 24.81 Punkte

๐Ÿ“Œ The iOS Calculator Might Not be Adding Numbers Correctly


๐Ÿ“ˆ 24.81 Punkte

๐Ÿ“Œ [dos] WebKit - WebAssembly Parsing Does not Correctly Check Section Order


๐Ÿ“ˆ 24.81 Punkte

๐Ÿ“Œ #0daytoday #WebKit - WebAssembly Parsing Does not Correctly Check Section Order Vulnerability [#0day #Exploit]


๐Ÿ“ˆ 24.81 Punkte

๐Ÿ“Œ ThinkPad t410 WiFi Card does not work correctly


๐Ÿ“ˆ 24.81 Punkte

๐Ÿ“Œ Second monitor not displaying content correctly


๐Ÿ“ˆ 24.81 Punkte

๐Ÿ“Œ Semmle: the login blocking mechanism does not work correctly


๐Ÿ“ˆ 24.81 Punkte

๐Ÿ“Œ Realm join fails - host name is not set correctly


๐Ÿ“ˆ 24.81 Punkte

๐Ÿ“Œ [APPSEC-1701] API token did not correctly expire


๐Ÿ“ˆ 24.81 Punkte

๐Ÿ“Œ 7 Ways To Fix a Mac Keyboard That Is Not Working Correctly


๐Ÿ“ˆ 24.81 Punkte

๐Ÿ“Œ Height: calc(100%) Not Working Correctly in CSS


๐Ÿ“ˆ 24.81 Punkte

๐Ÿ“Œ [APPSEC-1599] Admin login did not handle autocomplete feature correctly


๐Ÿ“ˆ 24.81 Punkte

๐Ÿ“Œ YouTube Not Working Correctly on Microsoft Edge


๐Ÿ“ˆ 24.81 Punkte

๐Ÿ“Œ codeblocks not rendering correctly in firefox


๐Ÿ“ˆ 24.81 Punkte

๐Ÿ“Œ Excel SUM Formula Not Adding Correctly: How to Fix


๐Ÿ“ˆ 24.81 Punkte

๐Ÿ“Œ Using your iPhone in high temperatures can cause permanent damage. Here's what not to do


๐Ÿ“ˆ 24.71 Punkte

๐Ÿ“Œ Don't use these passwords: These are the 10 logins most regularly found for sale online


๐Ÿ“ˆ 23.53 Punkte

๐Ÿ“Œ Data Science: Anaconda 5.0 mit neuen Compilern


๐Ÿ“ˆ 23.52 Punkte

๐Ÿ“Œ Xbox Scarlett: Dev-Kit der nรคchsten Microsoft-Konsole heiรŸt "Anaconda"


๐Ÿ“ˆ 23.52 Punkte

๐Ÿ“Œ Xbox Scarlett: Dev-Kit der nรคchsten Microsoft-Konsole heiรŸt "Anaconda"


๐Ÿ“ˆ 23.52 Punkte

๐Ÿ“Œ Xbox Scarlett: Das Dev-Kit soll angeblich Anaconda heiรŸen


๐Ÿ“ˆ 23.52 Punkte

๐Ÿ“Œ Xbox Scarlett: Dev-Kit der nรคchsten Microsoft-Konsole heiรŸt "Anaconda"


๐Ÿ“ˆ 23.52 Punkte











matomo